{"text_format":"1","workbook":"xlsx","n_sheets":10,"sheets":["Ax9-P1-MDO-Nao Desonerado","SubAx9.1-MDO-Desonerado","Ax9-P1-EPIs e Uniformes","Ax9-P2-Serviços","Ax9-P2-Comp.Serviços","Ax9-P3-Materiais","Ax9-P4-Ferramental","Ax9-P5-Valor Global","Desconto Médio","BDI"],"not_rendered":{"charts":0,"images":3,"macros":1,"external_links":0,"defined_names":20,"comments":0,"pivot_tables":0},"unopened":[],"bounds":{"document_bytes":16777216,"sheet_cells":100000,"rows_first":2000,"rows_last":500,"rows_between":2000,"halvings":0,"cell_chars":16384,"cell_head_chars":4096},"cells_cut":0,"cells_raw":0,"read":"whole","date_system":"1900"}

{"sheet":"Ax9-P1-MDO-Nao Desonerado","index":0,"n_rows":27,"n_cols":10,"rows_kept":27,"cut":false,"hidden":false,"merged":[[25,0,25,2],[25,4,25,9],[26,1,26,8],[0,0,0,9],[1,0,1,9],[3,0,4,0],[3,1,4,1],[3,2,4,2]]}
["Manutenção Elétrica - Pregão Eletrônico nº 067/2021"]
["ANEXO 9 - Planilha 1 - Resumo de Composição de Custos para a Equipe de Dedicação Exclusiva - Não Desonerado"]
[]
["Subitem","Especificação","Categoria (cargo)","Nº de\nprofissionais","Salário\nBase\n(R$)","Adicional de\nPericulosidade","Adicional\nNoturno","Valor\nUnitário\nMensal\n(R$)","Valor\nTotal\nMensal\n(R$)","Valor\nTotal Para\n30 (Trinta)\nMeses (R$)"]
[null,null,null,"(A)",null,null,null,"(B)","(C)=(A)*(B)","(D)=(C)*30"]
["1.1","SF-01403","Supervisor Técnico – Sistema Elétrico",2,9366.57,0.3,null,24203.43,{"$f":"ROUND(H6*D6,2)","v":48406.86},{"$f":"I6*30","v":1452205.8}]
["1.2","SF-01404","Supervisor Técnico – Sistema Elétrico e Segurança do Trabalho",1,9366.57,0.3,null,24200.29,{"$f":"ROUND(H7*D7,2)","v":24200.29},{"$f":"I7*30","v":726008.70000000007}]
["1.3","SF-01405","Técnico em Segurança do Trabalho",1,2964.47,0.3,null,8314.5300000000007,8314.5300000000007,249435.90000000002]
["1.4","SF-01406","Auxiliar de Almoxarifado",2,1218.82,null,null,3267.87,6535.74,196072.19999999998]
["1.5","SF-01407","Auxiliar Administrativo",2,1218.82,null,null,3266.78,6533.56,196006.80000000002]
["1.6","SF-01408","Desenhista Técnico",2,2539.2199999999998,0.3,null,7297.47,14594.94,437848.2]
["1.7","SF-01409","Técnico em Eletrotécnica Encarregado",6,2608.2199999999998,0.3,null,7531.46,45188.76,1355662.8]
["1.8","SF-01410","Técnico em Eletrotécnica Planejador de Manutenção",1,2778.32,0.3,null,7878.18,7878.18,236345.40000000002]
["1.9","SF-01411","Técnico em Eletrotécnica Termografista",1,2835.02,0.3,null,8072.52,8072.52,242175.6]
["1.10","SF-01412","Técnico em Eletrotécnica",17,2539.2199999999998,0.3,null,7324.12,124510.04,3735301.1999999997]
["1.11","SF-01413","Eletricista",17,1829.14,null,null,4470.37,75996.289999999994,2279888.6999999997]
["1.12","SF-01414","Auxiliar de Eletricista",14,1324.07,null,null,3528.01,49392.14,1481764.2]
["1.13","SF-01415","Técnico em Eletromecânica",2,2539.2199999999998,0.3,null,7306.93,14613.86,438415.80000000005]
["1.14","SF-01416","Técnico em Automação",5,2539.2199999999998,0.3,null,7316.11,36580.550000000003,1097416.5]
["1.15","SF-01417","Técnico em Eletrotécnica Plantonista (diurno)",4,2539.2199999999998,0.3,null,7474.89,29899.56,896986.8]
["1.16","SF-01418","Técnico em Eletrotécnica Plantonista (noturno)",4,2539.2199999999998,0.3,0.2,8381.86,33527.440000000002,1005823.2000000001]
["1.17","SF-01419","Eletricista Plantonista (diurno)",8,1829.14,null,null,4408.71,35269.68,1058090.3999999999]
["1.18","SF-01420","Eletricista Plantonista (noturno)",8,1829.14,null,0.2,4911.3100000000004,39290.480000000003,1178714.4000000001]
["1.19","SF-01421","Eletricista Plantonista – Áreas Restritas (diurno)",6,1829.14,0.3,null,5617.8,33706.800000000003,1011204.0000000001]
["1.20","SF-01422","Eletricista Plantonista – Áreas Restritas (noturno)",6,1829.14,0.3,0.2,6271.13,37626.78,1128803.3999999999]
["Total",null,null,109]
[1,"Subtotal de Equipe de Dedicação Exclusiva para 30 Meses (R$)",null,null,null,null,null,null,null,{"$f":"SUM(J6:J25)","v":20404169.999999996}]

{"sheet":"SubAx9.1-MDO-Desonerado","index":1,"n_rows":27,"n_cols":10,"rows_kept":27,"cut":false,"hidden":false,"merged":[[25,0,25,2],[25,4,25,9],[26,1,26,8],[0,0,0,9],[1,0,1,9],[3,0,4,0],[3,1,4,1],[3,2,4,2]]}
["Manutenção Elétrica - Pregão Eletrônico nº 067/2021"]
["SUBANEXO 9.1 - Resumo de Composição de Custos para a Equipe de Dedicação Exclusiva - Desonerado"]
[]
["Subitem","Especificação","Categoria (cargo)","Nº de\nprofissionais","Salário\nBase\n(R$)","Adicional de\nPericulosidade","Adicional\nNoturno","Valor\nUnitário\nMensal\n(R$)","Valor\nTotal\nMensal\n(R$)","Valor\nTotal Para\n30 (Trinta)\nMeses (R$)"]
[null,null,null,"(A)",null,null,null,"(B)","(C)=(A)*(B)","(D)=(C)*30"]
["1.1","SF-01403","Supervisor Técnico – Sistema Elétrico",2,9366.57,0.3,null,22036.29,{"$f":"ROUND(H6*D6,2)","v":44072.58},{"$f":"I6*30","v":1322177.4000000001}]
["1.2","SF-01404","Supervisor Técnico – Sistema Elétrico e Segurança do Trabalho",1,9366.57,0.3,null,22032.98,{"$f":"ROUND(H7*D7,2)","v":22032.98},{"$f":"I7*30","v":660989.4}]
["1.3","SF-01405","Técnico em Segurança do Trabalho",1,2964.47,0.3,null,7664.9,7664.9,229947]
["1.4","SF-01406","Auxiliar de Almoxarifado",2,1218.82,null,null,3097.75,6195.5,185865]
["1.5","SF-01407","Auxiliar Administrativo",2,1218.82,null,null,3096.6,6193.2,185796]
["1.6","SF-01408","Desenhista Técnico",2,2539.2199999999998,0.3,null,6750.76,13501.52,405045.60000000003]
["1.7","SF-01409","Técnico em Eletrotécnica Encarregado",6,2608.2199999999998,0.3,null,6971.85,41831.1,1254933]
["1.8","SF-01410","Técnico em Eletrotécnica Planejador de Manutenção",1,2778.32,0.3,null,7274.06,7274.06,218221.80000000002]
["1.9","SF-01411","Técnico em Eletrotécnica Termografista",1,2835.02,0.3,null,7457.92,7457.92,223737.60000000001]
["1.10","SF-01412","Técnico em Eletrotécnica",17,2539.2199999999998,0.3,null,6778.89,115241.13,3457233.9000000004]
["1.11","SF-01413","Eletricista",17,1829.14,null,null,4191.07,71248.19,2137445.7000000002]
["1.12","SF-01414","Auxiliar de Eletricista",14,1324.07,null,null,3341.99,46787.86,1403635.8]
["1.13","SF-01415","Técnico em Eletromecânica",2,2539.2199999999998,0.3,null,6760.75,13521.5,405645]
["1.14","SF-01416","Técnico em Automação",5,2539.2199999999998,0.3,null,6770.44,33852.199999999997,1015565.9999999999]
["1.15","SF-01417","Técnico em Eletrotécnica Plantonista (diurno)",4,2539.2199999999998,0.3,null,6868.26,27473.040000000001,824191.20000000007]
["1.16","SF-01418","Técnico em Eletrotécnica Plantonista (noturno)",4,2539.2199999999998,0.3,0.2,7689.36,30757.439999999999,922723.2]
["1.17","SF-01419","Eletricista Plantonista (diurno)",8,1829.14,null,null,4087.34,32698.720000000001,980961.60000000009]
["1.18","SF-01420","Eletricista Plantonista (noturno)",8,1829.14,null,0.2,4542.33,36338.639999999999,1090159.2]
["1.19","SF-01421","Eletricista Plantonista – Áreas Restritas (diurno)",6,1829.14,0.3,null,5193.7,31162.2,934866]
["1.20","SF-01422","Eletricista Plantonista – Áreas Restritas (noturno)",6,1829.14,0.3,0.2,5785.2,34711.199999999997,1041335.9999999999]
["Total",null,null,109]
[1,"Subtotal de Equipe de Dedicação Exclusiva para 30 Meses (R$)",null,null,null,null,null,null,null,{"$f":"SUM(J6:J25)","v":18900476.399999999}]

{"sheet":"Ax9-P1-EPIs e Uniformes","index":2,"n_rows":37,"n_cols":6,"rows_kept":37,"cut":false,"hidden":false,"merged":[[30,0,30,4],[36,0,36,4],[0,0,0,5],[1,0,1,5],[3,0,4,0],[3,1,4,1],[3,2,4,2],[32,0,33,0],[32,1,33,1],[32,2,33,2]]}
["Manutenção Elétrica - Pregão Eletrônico nº 067/2021"]
["ANEXO 9 - Planilha 1 - Complementação - EPIs e Uniformes"]
[]
["Especificação","Descrição","Unid.","Quantidade\nEstimada p/\n30 (Trinta)\nMeses","Preço\nUnitário\n(R$)","Preço\nTotal\n(R$)"]
[null,null,null,"(A)","(B)","(C)=(A)*(B)"]
["SF-02572","Luva isolante classe 0","par",156,375,{"$f":"ROUND(E6*D6,2)","v":58500}]
["SF-02573","Luva isolante classe 2","par",24,415.68,{"$f":"ROUND(E7*D7,2)","v":9976.32}]
["SF-02574","Luva de cobertura para luva isolante","par",180,28.91,5203.8]
["SF-02575","Bolsa para luvas isolantes","un",180,36.590000000000003,6586.2]
["SF-00827","Calçado isolante elétrico","par",320,152.56,48819.199999999997]
["SF-02576","Vestimenta antichama classe 2","un",348,247.5,86130]
["SF-02577","Vestimenta antichama classe 4","un",4,1458,5832]
["SF-02578","Capuz antichama classe 4","un",4,1799.99,7199.96]
["SF-02579","Balaclava antichama classe 2","un",4,128.38999999999999,513.55999999999995]
["SF-00830","Capacete de segurança","un",320,45.32,14502.4]
["SF-00836","Óculos de segurança","un",650,8.4600000000000009,5499]
["SF-00837","Protetor auricular de inserção","un",525,2.4900000000000002,1307.25]
["SF-02580","Protetor auricular tipo abafador dielétrico","un",30,30.06,901.8]
["SF-00838","Protetor facial","un",78,179.5,14001]
["SF-02581","Respirador PFF-2","un",718,9.1,6533.8]
["SF-02582","Luva nitrílica","cx",100,123.9,12390]
["SF-02583","Luva de nylon com banho em PU","par",474,4.2,1990.8]
["SF-02584","Luva de vaqueta","par",163,11.14,1815.82]
["SF-02585","Capacete de segurança para trabalho em altura","un",50,160.11000000000001,8005.5]
["SF-00828","Bota de PVC","par",59,38.380000000000003,2264.42]
["SF-02586","Luva para proteção química","par",295,7.89,2327.5500000000002]
["SF-02587","Luva pigmentada","par",494,2.73,1348.62]
["SF-02588","Protetor solar","L",150,104.17,15625.5]
["SF-02589","Sabonete desengraxante","L",150,19.86,2979]
["SF-00829","Capa de chuva","un",200,15.93,3186]
{"$rows_left_out":8}
{"sheet":"Ax9-P2-Serviços","index":3,"n_rows":17,"n_cols":10,"rows_kept":17,"cut":false,"hidden":false,"merged":[[3,0,4,0],[3,1,4,1],[3,2,4,2],[3,3,4,3],[16,1,16,8]]}
["Manutenção Elétrica - Pregão Eletrônico nº 067/2021"]
["ANEXO 9 - Planilha 2 – Composição de Custos para os Serviços sob Demanda"]
[]
["Subitem","Especificação","Descrição","Unid.","Quantidade\nEstimada p/\n30 (Trinta)\nMeses","Custo\nUnitário\n(R$)","Custo\nDireto\n(R$)","BDI (%)","Preço\nUnitário\ncom BDI\n(R$)","Preço\nTotal\n(R$)"]
[null,null,null,null,"(A)",null,null,null,"(B)","(C)=(A)*(B)"]
["2.1","SF-02368","Análise físico-química de óleo isolante","un",25,170.22,{"$f":"ROUND(E6*F6,2)","v":4255.5},{"$f":"BDI!$E$17","v":0.11260000000000001},{"$f":"ROUND(F6*(1+H6),2)","v":189.39},{"$f":"E6*I6","v":4734.75}]
["2.2","SF-02369","Análise de gases dissolvidos em óleo isolante","un",25,132.81,{"$f":"ROUND(E7*F7,2)","v":3320.25},{"$f":"BDI!$E$17","v":0.11260000000000001},{"$f":"ROUND(F7*(1+H7),2)","v":147.76},{"$f":"E7*I7","v":3694}]
["2.3","SF-02370","Análise de teor de PCB em óleo isolante","un",5,361.31,1806.55,{"$f":"BDI!$E$17","v":0.11260000000000001},401.99,2009.95]
["2.4","SF-02371","Descarte de lâmpadas","un",30000,1.5,45000,{"$f":"BDI!$E$17","v":0.11260000000000001},1.67,50100]
["2.5","SF-02372","Descarte de reatores e demais resíduos eletroeletrônicos","kg",2000,0.98,1960,{"$f":"BDI!$E$17","v":0.11260000000000001},1.0900000000000001,2180]
["2.6","SF-02373","Aluguel de caminhão munck","dia",30,1200,36000,{"$f":"BDI!$E$17","v":0.11260000000000001},1335.12,40053.599999999999]
["2.7","SF-02374","Aluguel de plataforma aérea","dia",30,1503.33,45099.9,{"$f":"BDI!$E$17","v":0.11260000000000001},1672.6,50178]
["2.8","SF-02375","Aluguel de empilhadeira","dia",5,750,3750,{"$f":"BDI!$E$17","v":0.11260000000000001},834.45,4172.25]
["2.9","SF-02377","Aluguel de grupo motor-gerador de 200 kVA","dia",10,1740,17400,{"$f":"BDI!$E$17","v":0.11260000000000001},1935.92,19359.2]
["2.10","SF-02378","Hora de funcionamento grupo motor-gerador de 200 kVA","h",100,250,25000,{"$f":"BDI!$E$17","v":0.11260000000000001},278.14999999999998,27814.999999999996]
["2.11","SF-02379","Solda exotérmica","un",1000,{"$f":"OFFSET(INDEX('Ax9-P2-Comp.Serviços'!A:H,MATCH(B16,'Ax9-P2-Comp.Serviços'!A:A,0),8),2,0)","v":39.031699999999994},39031.699999999997,{"$f":"BDI!$B$17","v":0.191},46.49,46490]
[2,"Subtotal de Serviços sob Demanda para 30 Meses com BDI (R$)",null,null,null,null,null,null,null,{"$f":"SUBTOTAL(109,J6:J16)","v":250786.75}]

{"sheet":"Ax9-P2-Comp.Serviços","index":4,"n_rows":11,"n_cols":8,"rows_kept":11,"cut":false,"hidden":false,"merged":[[4,1,11,1],[4,0,11,0]]}
["Manutenção Elétrica - Pregão Eletrônico nº 067/2021"]
["Composições de Custos Unitários de Serviços"]
[]
["Especificação","Descrição","Discriminação da Composição","Unidade","Coeficiente","Custo\nUnitário\n(R$)","Custo\nTotal\n(R$)","Total do\nServiço\n(R$)"]
["SF-02379",{"$f":"INDEX('Ax9-P2-Serviços'!B:C,MATCH('Ax9-P2-Comp.Serviços'!A5,'Ax9-P2-Serviços'!B:B,0),2)","v":"Solda exotérmica"},null,{"$f":"TRIM(INDEX('Ax9-P2-Serviços'!D:D,MATCH('Ax9-P2-Comp.Serviços'!A5,'Ax9-P2-Serviços'!B:B,0),1))","v":"un"},null,"",{"$f":"IF(ISNUMBER(F5),E5*F5,\"\")","v":""}]
[null,null,null,null,null,"",""]
[null,null,"Eletricista com Encargos Complementares","h",0.08,22.268000000000001,1.7814400000000001,{"$f":"SUM(G7:G11)","v":39.031699999999994}]
[null,null,"Servente com Encargos Complementares","h",0.08,16.311500000000002,1.3049200000000003]
[null,null,"Cartucho de Solda Exotérmica n.º 90","un",1,24.975499999999997,24.975499999999997]
[null,null,"Ignex - Palito Ignitor para Solda Exotérmica","un",1,3.5719999999999996,3.5719999999999996]
[null,null,"Molde p/ Solda Tipo \"T\" até 35mm²","un",0.04,184.946,7.3978400000000004]

{"sheet":"Ax9-P3-Materiais","index":5,"n_rows":923,"n_cols":10,"rows_kept":923,"cut":false,"hidden":false,"merged":[[3,0,4,0],[3,1,4,1],[3,2,4,2],[3,3,4,3],[922,1,922,8]]}
["Manutenção Elétrica - Pregão Eletrônico nº 067/2021"]
["ANEXO 9 - Planilha 3 – Composição de Custos para os Materiais"]
[]
["Subitem","Especificação","Descrição","Unid.","Quantidade\nEstimada p/\n30 Meses","Custo\nUnitário\n(R$)","Custo\nDireto\n(R$)","BDI (%)","Preço\nUnitário\nc/ BDI (R$)","Preço\nTotal\n(R$)"]
[null,null,null,null,"(A)",null,null,null,"(B)","(C)=(A)*(B)"]
["3.1","SF-01423","Conjunto parafuso, porca e arruelas M5","un",5000,0.5,{"$f":"ROUND(E6*F6,2)","v":2500},{"$f":"BDI!$E$17","v":0.11260000000000001},{"$f":"ROUND(F6*(1+H6),2)","v":0.56000000000000005},{"$f":"E6*I6","v":2800.0000000000005}]
["3.2","SF-01424","Conjunto parafuso, porca e arruelas M6","un",5000,0.62,{"$f":"ROUND(E7*F7,2)","v":3100},{"$f":"BDI!$E$17","v":0.11260000000000001},{"$f":"ROUND(F7*(1+H7),2)","v":0.69},3449.9999999999995]
["3.3","SF-01425","Conjunto parafuso, porca e arruelas M8","un",5000,1.25,6250,{"$f":"BDI!$E$17","v":0.11260000000000001},1.39,6949.9999999999991]
["3.4","SF-01426","Conjunto parafuso, porca e arruelas M10","un",5000,3.35,16750,{"$f":"BDI!$E$17","v":0.11260000000000001},3.73,18650]
["3.5","SF-01427","Conjunto parafuso, porca e arruelas M12","un",2500,2.89,7225,{"$f":"BDI!$E$17","v":0.11260000000000001},3.22,8050.0000000000009]
["3.6","SF-01428","Identificador para botão de emergência","un",200,9.3000000000000007,1860,{"$f":"BDI!$E$17","v":0.11260000000000001},10.35,2070]
["3.7","SF-01429","Prensa cabos","un",200,9.75,1950,{"$f":"BDI!$E$17","v":0.11260000000000001},10.85,2170]
["3.8","SF-01430","Bloco de distribuição 2 x 7","un",100,70.5,7050,{"$f":"BDI!$E$17","v":0.11260000000000001},78.44,7844]
["3.9","SF-01431","Bloco de distribuição 2 x 15","un",100,75.03,7503,{"$f":"BDI!$E$17","v":0.11260000000000001},83.48,8348]
["3.10","SF-01432","Bloco de distribuição 4 x 7","un",100,146.91999999999999,14692,{"$f":"BDI!$E$17","v":0.11260000000000001},163.46,16346]
["3.11","SF-01433","Bloco de distribuição 4 x 15","un",100,205,20500,{"$f":"BDI!$E$17","v":0.11260000000000001},228.08,22808]
["3.12","SF-01434","Isolador de baixa tensão para barramentos","un",1000,6.83,6830,{"$f":"BDI!$E$17","v":0.11260000000000001},7.6,7600]
["3.13","SF-01435","Trilho DIN 35mm","m",600,16.95,10170,{"$f":"BDI!$E$17","v":0.11260000000000001},18.86,11316]
["3.14","SF-01436","Suporte para trilho DIN","un",200,7.94,1588,{"$f":"BDI!$E$17","v":0.11260000000000001},8.83,1766]
["3.15","SF-01437","Barramento de cobre","cm3",50000,1.07,53500,{"$f":"BDI!$E$17","v":0.11260000000000001},1.19,59500]
["3.16","SF-01438","Desumidificador para painel","un",30,206.09,6182.7,{"$f":"BDI!$E$17","v":0.11260000000000001},229.3,6879]
["3.17","SF-01439","Conjunto ventilador para painel elétrico 150 mm","un",40,320.29000000000002,12811.6,{"$f":"BDI!$E$17","v":0.11260000000000001},356.35,14254]
["3.18","SF-01440","Conjunto ventilador para painel elétrico 200 mm","un",40,564.65,22586,{"$f":"BDI!$E$17","v":0.11260000000000001},628.23,25129.200000000001]
["3.19","SF-01441","Conjunto ventilador para painel elétrico 250 mm","un",40,820.31,32812.400000000001,{"$f":"BDI!$E$17","v":0.11260000000000001},912.68,36507.199999999997]
["3.20","SF-01442","Conjunto ventilador para painel elétrico 325 mm","un",40,1083.8499999999999,43354,{"$f":"BDI!$E$17","v":0.11260000000000001},1205.8900000000001,48235.600000000006]
["3.21","SF-01443","Porta documentos","un",100,42,4200,{"$f":"BDI!$E$17","v":0.11260000000000001},46.73,4673]
["3.22","SF-01444","Tomada auxiliar","un",200,44.76,8952,{"$f":"BDI!$E$17","v":0.11260000000000001},49.8,9960]
["3.23","SF-01445","Fixador/clip autoadesivo para abraçadeiras de nylon","pct",200,0.78,156,{"$f":"BDI!$E$17","v":0.11260000000000001},0.87,174]
["3.24","SF-01446","Spira-duto 1/8","m",500,1.75,875,{"$f":"BDI!$E$17","v":0.11260000000000001},1.95,975]
["3.25","SF-01447","Spira-duto 1/4","m",500,2.2000000000000002,1100,{"$f":"BDI!$E$17","v":0.11260000000000001},2.4500000000000002,1225]
{"$rows_left_out":894}
{"sheet":"Ax9-P4-Ferramental","index":6,"n_rows":232,"n_cols":10,"rows_kept":232,"cut":false,"hidden":false,"merged":[[231,1,231,8],[3,0,4,0],[3,1,4,1],[3,2,4,2],[3,3,4,3]]}
["Manutenção Elétrica - Pregão Eletrônico nº 067/2021"]
["ANEXO 9 - Planilha 4 – Depreciação de Ferramental"]
[]
["Subitem","Especificação","Descrição","Unidade","Quant.\nTotal","Vida\nÚtil\n(anos)","Valor\nUnitário de\nAquisição\n(R$)","Valor\nTotal de\nAquisição\n(R$)","Valor\nMensal de\nDepreciação\n(R$)","Valor Total\nDepreciação\nem 30 meses\n(R$)"]
[null,null,null,null,"(A)","(B)","(C)","(D)=(A)*(C) ","(E)=(D)/(12*B)","(F)=30*(E)"]
["4.1","SF-02380","Chave de abertura de painéis","un",90,5,250,{"$f":"E6*G6","v":22500},{"$f":"ROUND(H6/(12*F6),2)","v":375},{"$f":"I6*30","v":11250}]
["4.2","SF-02381","Caixa de ferramentas 40 cm","un",70,5,150.30000000000001,10521,175.35,{"$f":"I7*30","v":5260.5}]
["4.3","SF-02382","Caixa de ferramentas 50 cm","un",50,5,272.89,13644.5,227.41,6822.3]
["4.4","SF-02383","Carrinho de ferramentas","un",11,5,2725,29975,499.58,14987.4]
["4.5","SF-02384","Transpalete manual","un",2,5,1819.99,3639.98,60.67,1820.1000000000001]
["4.6","SF-02385","Carrinho plataforma","un",2,5,1987.71,3975.42,66.260000000000005,1987.8000000000002]
["4.7","SF-02386","Mesa hidráulica pantográfica","un",2,5,3630.54,7261.08,121.02,3630.6]
["4.8","SF-02387","Lanterna","un",91,10,118.09,10746.19,89.55,2686.5]
["4.9","SF-02388","Cavalete de sinalização de manutenção","un",25,5,33.9,847.5,14.13,423.90000000000003]
["4.10","SF-02389","Cone de sinalização","un",25,5,44.792499999999997,1119.8125,18.66,559.79999999999995]
["4.11","SF-02390","Detector de tensão sem contato de baixa tensão","un",105,10,139,14595,121.63,3648.8999999999996]
["4.12","SF-02391","Detector de tensão sem contato de média tensão","un",2,10,1864.16,3728.32,31.07,932.1]
["4.13","SF-02392","Conjunto de aterramento temporário para baixa tensão","un",5,5,1270,6350,105.83,3174.9]
["4.14","SF-02393","Conjunto de aterramento temporário para média tensão","un",2,5,1999,3998,66.63,1998.8999999999999]
["4.15","SF-02394","Grampo de aterramento concha-bola","un",1,5,400.5,400.5,6.68,200.39999999999998]
["4.16","SF-02395","Lençol isolante classe 4","un",5,5,705,3525,58.75,1762.5]
["4.17","SF-02396","Bastão de resgate (ferramental)","un",3,5,1250,3750,62.5,1875]
["4.18","SF-02397","Vara de manobra","un",1,5,1300,1300,21.67,650.1]
["4.19","SF-02398","Cadeado para disjuntores (ferramental)","un",150,5,42.9,6435,107.25,3217.5]
["4.20","SF-02399","Bloqueio para disjuntores (ferramental)","un",150,5,54,8100,135,4050]
["4.21","SF-02400","Etiqueta de bloqueio","un",600,5,9.83,5898,98.3,2949]
["4.22","SF-02401","Inflador de luvas","un",1,5,1680,1680,28,840]
["4.23","SF-02402","Protetor de cabos","un",30,5,342,10260,171,5130]
["4.24","SF-02403","Escada duplo acesso 4 degraus","un",15,5,515.73,7735.9500000000007,128.93,3867.9]
["4.25","SF-00738","Escada duplo acesso 6 degraus","un",15,5,960,14400,240,7200]
{"$rows_left_out":203}
{"sheet":"Ax9-P5-Valor Global","index":7,"n_rows":10,"n_cols":5,"rows_kept":10,"cut":false,"hidden":false,"merged":[[0,0,0,4],[1,0,1,4],[9,0,9,3],[3,0,4,0],[3,1,4,1]]}
["Manutenção Elétrica - Pregão Eletrônico nº 067/2021"]
["ANEXO 9 - Planilha 5 – Valor Global Estimado para 30 (trinta) meses"]
[]
["Item","Descrição","Fator de Utilização ","Subtotal\ndo Item","Custo Global\nEstimado p/ 30\n(trinta) Meses"]
[null,null,"(A)","(B)","(C)=(A)*(B)"]
[1,"Subtotal de Equipe de Dedicação Exclusiva","N/A",{"$f":"'Ax9-P1-MDO-Nao Desonerado'!J27","v":20404169.999999996},{"$f":"D6","v":20404169.999999996}]
[2,"Subtotal de Serviços sob Demanda",0.5,{"$f":"'Ax9-P2-Serviços'!J17","v":250786.75},{"$f":"ROUND(C7*D7,2)","v":125393.38}]
[3,"Subtotal de Materiais",0.1,{"$f":"'Ax9-P3-Materiais'!J923","v":51244829.679999962},{"$f":"ROUND(C8*D8,2)","v":5124482.97}]
[4,"Subtotal de Depreciação de Ferramental","N/A",{"$f":"'Ax9-P4-Ferramental'!J232","v":568222.79999999993},{"$f":"D9","v":568222.79999999993}]
["Valor Global Estimado para 30 Meses",null,null,null,{"$f":"SUM(E6:E9)","v":26222269.149999995}]

{"sheet":"Desconto Médio","index":8,"n_rows":6,"n_cols":5,"rows_kept":6,"cut":false,"hidden":false,"merged":[[0,0,0,4],[1,0,1,4]]}
["Manutenção Elétrica - Pregão Eletrônico nº 067/2021"]
["PLANILHA ORÇAMENTÁRIA - Cálculo do Desconto Médio"]
[]
["Item","Descrição","Valor Orçado pelo\nSenado Federal\n(R$)","Subtotal\ndo Item\n(R$)","Desconto\nMédio "]
[2,"Subtotal de Serviços sob Demanda",250786.75,{"$f":"'Ax9-P2-Serviços'!J17","v":250786.75},{"$f":"ROUND(1-(D5/C5), 4)","v":0}]
[3,"Subtotal de Materiais",51244829.899999999,{"$f":"'Ax9-P3-Materiais'!J923","v":51244829.679999962},{"$f":"ROUND(1-(D6/C6), 4)","v":0}]

{"sheet":"BDI","index":9,"n_rows":40,"n_cols":5,"rows_kept":40,"cut":false,"hidden":false,"merged":[[4,0,6,0],[4,3,6,3],[39,0,39,4]]}
[{"$f":"'Ax9-P2-Serviços'!A1","v":"Manutenção Elétrica - Pregão Eletrônico nº 067/2021"}]
["BENEFÍCIOS E DESPESAS INDIRETAS - BDI"]
[]
["BDI Edificações",null,null,"BDI mero fornecimento"]
["Componentes do BDI","Cálculo sem CPRB",null,"Componentes do BDI","Cálculo sem CPRB"]
[null,"não-desonerado",null,null,"não-desonerado"]
[null,"% considerado",null,null,"% considerado"]
["AC",3.5000000000000003E-2,null,"AC",1.7500000000000002E-2]
["S+G",8.0000000000000002E-3,null,"S+G",3.8999999999999998E-3]
["R",1.2500000000000001E-2,null,"R",5.5999999999999999E-3]
["DF",7.6E-3,null,"DF",8.5000000000000006E-3]
["L",6.7799999999999999E-2,null,"L",3.5000000000000003E-2]
["PIS",6.4999999999999997E-3,null,"PIS",6.4999999999999997E-3]
["COFINS",0.03,null,"COFINS",0.03]
["CPRB",0,null,"CPRB",0]
["ISS",0.01,null,"ISS",0]
["BDI Edificações",{"$f":"ROUND(((1+B8+B9+B10)*(1+B11)*(1+B12))/(1-(B13+B14+B15+B16))-1,4)","v":0.191},null,"BDI mero fornecimento",{"$f":"ROUND(((1+E8+E9+E10)*(1+E11)*(1+E12))/(1-(E13+E14+E15+E16))-1,4)","v":0.11260000000000001}]
[]
[]
[]
[]
[]
[]
[]
[]
[]
[]
[]
[]
[]
{"$rows_left_out":10}